{"text_format":"1","workbook":"xlsx","n_sheets":2,"sheets":["Control","Rates"],"not_rendered":{"charts":0,"images":1,"macros":1,"external_links":0,"defined_names":7,"comments":0,"pivot_tables":0},"unopened":[],"bounds":{"document_bytes":16777216,"sheet_cells":100000,"rows_first":2000,"rows_last":500,"rows_between":2000,"halvings":0,"cell_chars":16384,"cell_head_chars":4096},"cells_cut":0,"cells_raw":0,"read":"whole","date_system":"1900"}

{"sheet":"Control","index":0,"n_rows":76,"n_cols":22,"rows_kept":76,"cut":false,"hidden":false,"merged":[[15,2,15,10],[11,7,11,8],[5,11,5,12],[7,11,7,12],[7,8,7,9],[8,2,8,6],[8,8,8,9],[10,5,10,8],[10,9,10,12],[11,9,11,10],[11,11,11,12],[17,1,17,8],[17,9,17,16],[18,1,18,4],[18,5,18,8],[18,9,18,12],[18,13,18,16],[1,17,1,18],[11,5,11,6],[5,8,5,9],[1,8,1,9],[2,8,2,9]]}
[]
[null,null,null,null,null,null,null,"Enter \nDate of Birth\n(DD/MM/YYYY)","Select \nBenefit Amount",null,"Select \nMale/Female",null,null,null,null,null,null,null,null,null,null,{"$f":"#VALUE!","v":{"$error":"#VALUE!"}}]
[null,null,null,null,null,null,null,null,1000,null,"Male"]
[]
[]
[null,null,null,null,null,null,null,"Date of Birth","Age Next Birthday\n(41 to 65)",null,"Benefit Amount"]
[null,null,null,null,null,null,{"$f":"G8","v":"00:00:00"},{"$f":"H8","v":"00:00:00"}]
[null,null,null,null,null,null,null,{"$f":"H3","v":"00:00:00"},{"$f":"DATEDIF(H8,NOW(),\"y\")+1","v":119},null,{"$f":"I3","v":1000},null,null,null,{"$f":"CONCATENATE(LEFT(#REF!,1),(TEXT((N8*10000)+V2,0)))","v":{"$error":"#REF!"}}]
[null,null," MyCare Plus Annual Premium",null,null,null,null,null,"Age Next Birthday must be between (41 - 65)"]
[]
[null,null,null,null,null,"MALE",null,null,null,"FEMALE"]
[null,null,null,null,null,"ElderShield300",null,"ElderShield400",null,"ElderShield300",null,"ElderShield400"]
[null,null,null,null,null,"12 years","Lifetime","12 years","Lifetime","12 years","Lifetime","12 years","Lifetime"]
[null,null,null,null,null,{"$f":"VLOOKUP(SUM(I8+K8),Rates!A6:J1130,3,FALSE)","v":{"$error":"#N/A"}},{"$f":"VLOOKUP(SUM(I8+K8),Rates!A6:J1130,4,FALSE)","v":{"$error":"#N/A"}},{"$f":"VLOOKUP(SUM(I8+K8),Rates!A6:J1130,5,FALSE)","v":{"$error":"#N/A"}},{"$f":"VLOOKUP(SUM(I8+K8),Rates!A6:J1130,6,FALSE)","v":{"$error":"#N/A"}},{"$f":"VLOOKUP(SUM(I8+K8),Rates!A6:J1130,7,FALSE)","v":{"$error":"#N/A"}},{"$f":"VLOOKUP(SUM(I8+K8),Rates!A6:J1130,8,FALSE)","v":{"$error":"#N/A"}},{"$f":"VLOOKUP(SUM(I8+K8),Rates!A6:J1130,9,FALSE)","v":{"$error":"#N/A"}},{"$f":"VLOOKUP(SUM(I8+K8),Rates!A6:J1130,10,FALSE)","v":{"$error":"#N/A"}}]
[]
[null,null," MyCare Annual Premium"]
[]
[null,"MALE",null,null,null,null,null,null,null,"FEMALE"]
[null,"ElderShield300",null,null,null,"ElderShield400",null,null,null,"ElderShield300",null,null,null,"ElderShield400"]
[null,"Limited","Limited","Lifetime","Lifetime","Limited","Limited","Lifetime","Lifetime","Limited","Limited","Lifetime","Lifetime","Limited","Limited","Lifetime","Lifetime"]
[null,"12 years","Lifetime","12 years","Lifetime","12 years","Lifetime","12 years","Lifetime","12 years","Lifetime","12 years","Lifetime","12 years","Lifetime","12 years","Lifetime"]
[null,{"$f":"VLOOKUP(SUM(I8+K8),Rates!K7:AB1131,3,FALSE)","v":{"$error":"#N/A"}},{"$f":"VLOOKUP(SUM(I8+K8),Rates!K7:AB1131,4,FALSE)","v":{"$error":"#N/A"}},{"$f":"VLOOKUP(SUM(I8+K8),Rates!K7:AB1131,5,FALSE)","v":{"$error":"#N/A"}},{"$f":"VLOOKUP(SUM(I8+K8),Rates!K7:AB1131,6,FALSE)","v":{"$error":"#N/A"}},{"$f":"VLOOKUP(SUM(I8+K8),Rates!K7:AB1131,7,FALSE)","v":{"$error":"#N/A"}},{"$f":"VLOOKUP(SUM(I8+K8),Rates!K7:AB1131,8,FALSE)","v":{"$error":"#N/A"}},{"$f":"VLOOKUP(SUM(I8+K8),Rates!K7:AB1131,9,FALSE)","v":{"$error":"#N/A"}},{"$f":"VLOOKUP(SUM(I8+K8),Rates!K7:AB1131,10,FALSE)","v":{"$error":"#N/A"}},{"$f":"VLOOKUP(SUM(I8+K8),Rates!K7:AB1131,11,FALSE)","v":{"$error":"#N/A"}},{"$f":"VLOOKUP(SUM(I8+K8),Rates!K7:AB1131,12,FALSE)","v":{"$error":"#N/A"}},{"$f":"VLOOKUP(SUM(I8+K8),Rates!K7:AB1131,13,FALSE)","v":{"$error":"#N/A"}},{"$f":"VLOOKUP(SUM(I8+K8),Rates!K7:AB1131,14,FALSE)","v":{"$error":"#N/A"}},{"$f":"VLOOKUP(SUM(I8+K8),Rates!K7:AB1131,15,FALSE)","v":{"$error":"#N/A"}},{"$f":"VLOOKUP(SUM(I8+K8),Rates!K7:AB1131,16,FALSE)","v":{"$error":"#N/A"}},{"$f":"VLOOKUP(SUM(I8+K8),Rates!K7:AB1131,17,FALSE)","v":{"$error":"#N/A"}},{"$f":"VLOOKUP(SUM(I8+K8),Rates!K7:AB1131,18,FALSE)","v":{"$error":"#N/A"}}]
[]
[]
[]
[]
[null,"Updated March'17"]
[]
[]
[]
[]
[null,null,600]
[null,null,700]
[null,null,800]
[null,null,900]
[null,null,1000]
[null,null,1100]
[null,null,1200]
[null,null,1300]
[null,null,1400]
[null,null,1500]
[null,null,1600]
[null,null,1700]
[null,null,1800]
[null,null,1900]
[null,null,2000]
[null,null,2100,null,0,0,"Classic","Yes","Zone 1","Male"]
[null,null,2200,null,850,0.2,"Supreme","No","Zone 2","Female"]
[null,null,2300,null,1750,0.25,"Elite",null,"Zone 3"]
[null,null,2400,null,3500,0.3,null,null,"Zone 4"]
[null,null,2500,null,null,null,null,null,"Zone 5"]
[null,null,2600,null,null,null,null,null,"Zone 6"]
[null,null,2700,null,null,null,null,null,"Zone 7"]
[null,null,2800,null,null,null,null,null,"Zone 8"]
[null,null,2900]
[null,null,3000]
[null,null,3100]
[null,null,3200]
[null,null,3300]
[null,null,3400]
[null,null,3500]
[null,null,3600]
[null,null,3700]
[null,null,3800]
[null,null,3900]
[null,null,4000]
[null,null,4100]
[null,null,4200]
[null,null,4300]
[null,null,4400]
[null,null,4500]
[null,null,4600]
[null,null,4700]
[null,null,4800]
[null,null,4900]
[null,null,5000]

{"sheet":"Rates","index":1,"n_rows":1131,"n_cols":28,"rows_kept":1131,"cut":false,"hidden":true,"merged":[[0,2,0,5],[0,6,0,9],[1,2,1,3],[1,4,1,5],[1,6,1,7],[1,8,1,9],[0,12,0,19],[0,20,0,27],[1,12,1,15],[1,16,1,19],[1,20,1,23],[1,24,1,27]]}
[null,"Gender","Male",null,null,null,"Female",null,null,null,null,"Gender","Male",null,null,null,null,null,null,null,"Female"]
[null,"Basic ElderShield","ElderShield300",null,"ElderShield400",null,"ElderShield300",null,"ElderShield400",null,null,"Basic ElderShield","ElderShield300",null,null,null,"ElderShield400",null,null,null,"ElderShield300",null,null,null,"ElderShield400"]
[null,"Benefit Payout Duration","12 years","Lifetime","12 years","Lifetime","12 years","Lifetime","12 years","Lifetime",null,"Premium Payment Term","Limited","Limited","Lifetime","Lifetime","Limited","Limited","Lifetime","Lifetime","Limited","Limited","Lifetime","Lifetime","Limited","Limited","Lifetime","Lifetime"]
[null,"MyCare Plus",null,null,null,null,null,null,null,null,null,"Benefit Payout Duration","12 years","Lifetime","12 years","Lifetime","12 years","Lifetime","12 years","Lifetime","12 years","Lifetime","12 years","Lifetime","12 years","Lifetime","12 years","Lifetime"]
[null,"Entry Age (ANB)",null,null,null,null,null,null,null,null,null,"MyCare"]
[641,41,248.78,283.02,205.07,235.83,306.29000000000002,355.88,249.42,295.16000000000003,null,"Entry Age (ANB)"]
[642,42,257.07,292.54000000000002,211.22,243.1,317.08999999999997,368.51,257.5,305.06,641,41,300.35000000000002,353.85,199.02,226.41,245.46,295.05,164.03,188.64,370.49,447.31,245.03,284.67,300.88,372.95,199.5,236.1]
[643,43,265.79000000000002,302.49,217.69,250.75,328.44,381.83,266.06,315.33,642,42,315.81,371.99,205.65,234.01,257.5,309.5,168.95,194.47,390.55,471.39,253.64,294.79000000000002,316.51,392.37,205.98,244.01]
[644,44,275.10000000000002,312.98,224.59,258.77999999999997,340.47,395.85,275.10000000000002,326.3,643,43,332.72,391.62,212.61,241.98,270.55,325.17,174.14,200.57,412.38,497.6,262.74,305.43,333.52,413.45,212.82,252.25]
[645,45,284.89,324.20999999999998,231.87,267.33999999999997,353.21,410.61,284.57,337.8,644,44,351.17,413.13,220.05,250.38,284.89,342.35,179.65,206.99,436.24,526.16999999999996,272.37,316.67,352.08,436.51,220.05,261.02999999999997]
[646,46,295.32,336.09,239.63,276.33,366.74,426.4,294.68,350,645,45,371.45,436.67,227.91,259.37,300.56,361.07,185.48,213.84,462.51,557.58000000000004,282.52999999999997,328.49,372.47,461.87,227.64,270.23]
[647,47,306.5,348.66,247.92,285.89999999999998,381.13,443.09,305.43,362.89,646,46,393.81,462.72,236.26,268.83999999999997,317.83999999999997,381.83,191.69,221.06,491.45,592.29999999999995,293.39,341.12,394.99,489.79,235.72,279.97000000000003]
[648,48,318.33,362.03,256.69,296.12,396.38,460.8,316.88,376.64,647,47,418.58,491.56,245.19,278.89999999999998,337.05,404.78,198.32,228.71,523.54999999999995,630.71,304.89999999999998,354.44,419.92,520.77,244.33,290.29000000000002]
[649,49,331,376.21,266.06,306.93,412.59,479.52,328.97,391.09,648,48,427.41,501.83,254.66,289.60000000000002,343.31,412.38,205.33,236.9,535.48,645.16,317.08999999999997,368.62,428.64,531.74,253.48,301.31]
[650,50,344.49,391.3,276.01,318.43,429.82,499.37,341.87,406.49,649,49,436.56,512.53,264.77,300.94,349.78,420.24,212.82,245.51,547.79,659.92,330.04,383.6,437.63,542.97,263.17,312.87]
[651,51,358.82,407.3,286.60000000000002,330.52,448.17,520.45000000000005,355.51,422.81,650,50,446.08,523.6,275.58,313.02999999999997,356.58,428.43,220.79,254.71,560.52,675.17,343.84,399.48,446.89,554.53,273.49,325.17]
[652,52,374.13,424.42,297.89,343.42,467.7,542.86,370.06,440.04,651,51,456.03,535.11,287.02999999999997,325.82,363.64,436.83,229.25,264.39999999999998,573.67999999999995,690.85,358.5,416.34,456.46,566.4,284.41000000000003,338.23]
[653,53,390.5,442.61,309.93,357.11,488.46,566.66999999999996,385.57,458.39,652,52,466.47,547.14,299.27999999999997,339.51,371.08,445.66,238.29,274.72000000000003,587.27,707,374.13,434.26,466.31,578.6,296.02,352.03]
[654,54,408.04,462.08,322.77,371.77,510.66,592.08000000000004,402.05,477.86,653,53,477.43,559.66,312.39,354.06,378.83,454.8,247.92,285.69,601.34,723.69,390.76,453.31,476.58,591.17999999999995,308.43,366.69]
[655,55,426.77,482.78,336.46,387.34,534.41,619.16,419.65,498.57,654,54,488.94,572.77,326.39999999999998,369.63,387.02,464.27,258.19,297.41000000000003,616,740.98,408.53,473.64,487.17,604.17999999999995,321.64,382.26]
[656,56,446.94,504.99,351.23,404.03,559.82000000000005,647.99,438.54,520.72,655,55,501.03,586.47,341.38,386.22,395.58,474.17,269.16000000000003,309.87,631.35,758.95,427.52,495.3,498.25,617.6,335.71,398.84]
[657,57,468.61,528.95000000000005,367.01,421.95,587.11,678.86,458.66,544.26,656,56,513.76,600.75,357.54,403.98,404.57,484.44,280.98,323.19,647.35,777.57,447.85,518.36,509.86,631.41,350.8,416.55]
[658,58,491.88,554.63,384.02,441,616.42999999999995,711.82,480.27,569.4,657,57,527.19000000000005,615.79,374.87,423.13,414.04,495.25,293.61,337.53,664.04,796.78,469.68,543.08000000000004,521.84,645.58000000000004,366.9,435.38]
[659,59,517.02,582.19000000000005,402.27,461.44,647.89,747.4,503.44,596.26,658,58,541.37,631.62,393.49,443.68,423.99,506.65,307.2,352.78,681.48,816.62,493.11,569.45000000000005,534.29999999999995,660.19,384.18,455.5]
[660,60,544.04,611.77,421.74,483.37,682.02,785.75,528.53,625.30999999999995,659,59,556.35,648.47,413.61,465.72,434.58,518.74,321.8,369.15,699.78,837.54,518.30999999999995,597.91999999999996,547.41,675.65,402.75,477.01]
[661,61,573.20000000000005,643.71,442.71,506.86,718.93,827.11,555.6,656.66,660,60,572.5,666.56,435.22,489.42,445.87,531.74,337.37,386.7,719.36,860.07,545.59,628.57000000000005,561.42999999999995,692.29,422.81,500.23]
[662,62,604.66,678.06,465.29,532.05999999999995,759.11,872.16,585.02,690.63,661,61,589.89,686.03,458.55,514.94000000000005,458.07,545.70000000000005,354.17,405.48,740.65,884.57,575.13,661.69,576.67999999999995,710.37,444.48,525.32000000000005]
[663,63,638.63,715.19,489.47,559.17999999999995,803.14,921.27,617.12,727.6,662,62,608.72,707.16,483.69,542.44000000000005,471.28,560.79,372.2,425.65,763.98,911.43,607.28,697.69,593.41999999999996,730.22,468.02,552.49]
[664,64,675.44,755.31,515.58000000000004,588.23,851.4,975.2,652.38,768.1,663,63,629.21,730.11,510.87,572.13,485.51,577.16,391.57,447.31,789.77,941.12,642.48,737.02,611.99,752.21,493.7,582.08000000000004]
[665,65,715.51,798.97,543.83000000000004,619.79999999999995,904.79,1034.8,691.17,812.77,664,64,651.58000000000004,755.21,540.35,604.23,501.13,595.03,412.43,470.59,818.6,974.29,681.11,780.14,632.69000000000005,776.77,521.89,614.45000000000005]
[741,41,292.27,333.2,248.56,286.01,363.48,422.33,306.61,361.61,665,65,676.29,782.87,572.4,639.16,518.25,614.66,435.06,495.84,851.08,1011.74,723.8,827.81,656.12,804.59,552.91999999999996,650.19000000000005]
[742,42,302.64999999999998,345.08,256.8,295.64,376.96,437.95,317.36,374.5,741,41,355.67,418.37,233.8,266.54000000000002,300.77999999999997,359.57,198.81,228.77,441.64,531.67999999999995,290.77,337.8,372.04,457.32,245.24,289.22000000000003]
[743,43,313.56,357.43,265.47000000000003,305.7,391.19,454.43,328.81,387.93,742,42,374.61,440.47,242.09,276.01,316.29000000000002,377.98,205.39,236.47,466.25,561,301.52999999999997,350.32,392.21,481.98,253.86,299.55]
[744,44,325.23,370.49,274.72000000000003,316.29000000000002,406.23,471.76,340.85,402.21,743,43,395.37,464.43,250.81,285.89999999999998,333.2,397.99,212.34,244.5,493,592.94000000000005,312.92,363.48,414.14,508.79,263.01,310.3]
[745,45,337.48,384.5,284.45999999999998,327.63,422.17,490.06,353.53,417.25,744,44,418,490.7,260.12,296.39,351.71,419.92,219.72,253,522.32000000000005,627.72,324.95999999999998,377.39,438.17,538.04999999999995,272.64,321.75]
[746,46,350.59,399.22,294.89,339.46,439.07,509.69,367.01,433.3,745,45,442.87,519.42999999999995,269.95999999999998,307.57,371.99,443.84,227.54,262.04000000000002,554.53,666.02,337.69,392.05,464.49,570.30999999999995,282.8,333.79]
[747,47,364.55,414.89,305.97000000000003,352.14,457.05,530.29,381.35,450.1,746,46,470.32,551.21,280.45,319.33999999999997,394.35,470.32,235.88,271.57,590.04999999999995,708.34,351.23,407.72,493.59,605.83000000000004,293.55,346.57]
[748,48,379.48,431.53,317.83999999999997,365.62,476.1,552.28,396.6,468.13,747,47,500.76,586.41,291.63,331.86,419.23,499.64,244.76,281.68,629.48,755.21,365.62,424.2,525.85,645.26,305.06,360.06]
[749,49,395.37,449.24,330.42,379.96,496.43,575.54999999999995,412.81,487.12,748,48,512.1,599.52,303.56,345.18,428,510.07,254.23,292.48,644.67999999999995,773.34,380.87,441.8,537.84,659.92,317.26,374.5]
[750,50,412.27,468.02,343.79,395.15,517.99,600.22,430.03,507.34,749,49,523.87,613.11,316.24,359.36,437.1,520.82000000000005,264.29000000000002,303.93,660.35,791.96,397.08,460.42,550.19000000000005,675.01,330.2,389.69]
[751,51,430.25,488.03,358.02,411.25,540.94000000000005,626.38,448.28,528.74,750,50,536.07000000000005,627.23,329.77,374.39,446.56,532.05999999999995,274.99,316.08,676.56,811.17,414.36,480.16,562.92999999999995,690.52,344.01,405.85]
[752,52,449.51,509.43,373.27,428.43,565.44000000000005,654.30999999999995,467.8,551.48,751,51,548.86,641.89,344.17,390.39,456.46,543.61,286.39,328.97,693.31,830.96,432.71,501.08,576.09,706.52,358.61,422.97]
[753,53,470.1,532.11,389.53,446.62,591.54999999999995,683.94,488.67,575.66,752,52,562.29,657.25,359.57,407.51,466.89,555.76,298.58,342.72,710.59,851.35,452.29,523.39,589.62,722.95,374.18,441.16]
[754,54,492.2,556.45000000000005,406.92,466.15,619.37,715.51,510.76,601.29,753,53,576.36,673.24,376.05,425.65,477.76,568.38,311.58,357.27,728.56,872.42,473.21,547.09,603.79999999999995,739.91,390.87,460.47]
[755,55,515.79,582.45000000000005,425.49,487.01,649.16999999999996,749.27,534.41,628.67999999999995,754,54,591.17999999999995,689.99,393.71,445.12,489.26,581.49,325.49,372.9,747.23,894.31,495.46,572.34,618.41,757.51,408.58,480.97]
[756,56,541.26,610.27,445.55,509.32,681.16,785.17,559.88,657.89,755,55,606.69000000000005,707.48,412.59,465.93,501.24,595.19000000000005,340.37,389.59,766.82,917.04,519.32000000000005,599.36,633.71,775.7,427.52,502.9]
[757,57,568.6,640.4,467,533.4,715.46,823.74,587,689.13,756,56,623.11,725.83,432.98,488.19,513.91999999999996,609.53,356.42,407.4,787.25,940.64,544.9,628.09,649.76,794.48,447.85,526.28]
[758,58,598.02,672.6,490.17,558.97,752.42,864.99,616.27,722.57,757,57,640.4,745.09,454.86,512.26,527.24,624.55999999999995,373.59,426.66,808.65,965.03,572.34,658.96,666.45,813.84,469.57,551.26]
[759,59,629.86,707.27,515.1,586.52,792.01,909.45,647.55999999999995,758.31,758,58,658.64,765.37,478.4,538.04999999999995,541.26,640.4,392.1,447.15,830.96,990.34,601.88,691.97,683.78,833.9,492.95,578.01]
[760,60,664.15,744.61,541.85,616.21,835.03,957.44,681.54,796.99,759,59,677.95,786.99,503.86,565.76,556.19000000000005,657.25,412.06,469.2,854.4,1016.93,633.6,727.55,702.03,855.04,518.04,606.64]
[761,61,701.22,784.9,570.74,648.04999999999995,881.73,1009.28,718.4,838.83,760,60,698.76,810.2,531.30999999999995,595.66999999999996,572.13,675.38,433.46,492.95,879.49,1045.55,668,765.91,721.55,877.77,545.22,637.55999999999995]
[762,62,741.3,828.39,601.92999999999995,682.39,932.56,1065.83,758.47,884.3,761,61,721.23,835.19,560.95000000000005,627.88,589.41,694.86,456.57,518.41999999999996,906.77,1076.69,705.34,807.42,742.79,902.49,574.70000000000005,671.05]
[763,63,784.68,875.58,635.53,719.58,988.25,1127.51,802.23,933.84,762,62,745.58,862.31,592.99,662.7,608.13,715.94,481.5,545.91,936.62,1110.82,746,852.63,766.07,929.62,606.74,707.43]
[764,64,831.87,926.62,672.01,759.54,1049.3499999999999,1195.3499999999999,850.33,988.25,763,63,772.06,891.85,627.72,700.42,628.36,738.89,508.41,575.61,969.58,1148.54,790.57,902.01,791.8,959.63,641.79,747.07]
[765,65,883.23,982.21,711.55,803.04,1117.08,1270.3,903.45,1048.28,764,64,801,924.11,665.49,741.24,650.55999999999995,763.93,537.57000000000005,607.6,1006.44,1190.5899999999999,839.47,956.26,820.53,993.07,680.25,790.57]
[841,41,335.77,383.38,292.06,336.19,420.67,488.78,363.8,428.05,765,65,833.05,959.74,706.57,785.75,675.01,791.53,569.24,642.42999999999995,1047.9000000000001,1238.04,893.61,1016.18,852.95,1030.8900000000001,722.73,838.56]
[842,42,348.23,397.61,302.38,348.18,436.83,507.39,377.23,443.94,841,41,410.99,482.89,268.57,306.66000000000003,356.1,424.09,233.58,268.89,512.79999999999995,616.04999999999995,336.52,390.92,443.19,541.69000000000005,290.99,342.35]
[843,43,361.34,412.38,313.24,360.64,453.95,527.03,391.57,460.53,842,42,433.4,508.95,278.52,318,375.09,446.46,241.82,278.47000000000003,541.96,650.61,349.41,405.85,467.91,571.59,301.74,355.08]
[844,44,375.36,428,324.85000000000002,373.8,471.98,547.67999999999995,406.6,478.13,843,43,458.01,537.25,289.01,329.83,395.85,470.8,250.54,288.42,573.63,688.28,363.1,421.53,494.77,604.12,313.19,368.35]
[845,45,390.07,444.8,337.05,387.93,491.13,569.51,422.49,496.69,844,44,484.82,568.28,300.19,342.4,418.53,497.5,259.8,299.01,608.4,729.26,377.55,438.11,524.25,639.59,325.23,382.47]
[846,46,405.85,462.35,350.16,402.59,511.41,592.99,439.34,516.6,845,45,514.29999999999995,602.20000000000005,312.01,355.78,443.41,526.6,269.58999999999997,310.25,646.54999999999995,774.47,392.85,455.61,556.51,678.75,337.96,397.34]
[847,47,422.6,481.13,364.01,418.37,532.97,617.5,457.26,537.29999999999995,846,46,546.82000000000005,639.70000000000005,324.64,369.85,470.85,558.80999999999995,280.07,322.07,688.65,824.38,409.06,474.33,592.19000000000005,721.88,351.39,413.18]
[848,48,440.63,501.03,378.99,435.12,555.80999999999995,643.77,476.31,559.61,847,47,582.94000000000005,681.27,338.07,384.83,501.4,594.49,291.2,334.64,735.41,879.7,426.34,493.97,631.78,769.76,365.78,429.82]
[849,49,459.73,522.27,394.78,452.98,580.26,671.59,496.64,583.15,848,48,596.79,697.21,352.46,400.77,512.69000000000005,607.76,303.13,348.07,753.87,901.53,444.64,514.99,647.03,788.11,381.03,447.69]
[850,50,480.06,544.74,411.58,471.87,606.16,701.06,518.20000000000005,608.19000000000005,849,49,611.17999999999995,713.69,367.71,417.78,524.41,621.4,315.76,362.36,772.91,924,464.11,537.25,662.76,807.05,397.24,466.52]
[851,51,501.67,568.76,429.44,491.99,633.71,732.31,541.04999999999995,634.66999999999996,850,50,626.05999999999995,730.86,383.97,435.76,536.54999999999995,635.69000000000005,329.19,377.44,792.6,947.16,484.87,560.84,678.97,826.52,414.52,486.53]
[852,52,524.89,594.44000000000005,448.65,513.44000000000005,663.19,765.75,565.54999999999995,662.92,851,51,641.67999999999995,748.68,401.3,454.96,549.28,650.4,343.52,393.55,812.93,971.08,506.91,585.83000000000004,695.71,846.64,432.82,507.72]
[853,53,549.71,621.62,469.14,536.12,694.64,801.22,591.76,692.93,852,52,658.1,767.35,419.87,475.51,562.71,665.86,358.88,410.72,833.9,995.69,530.45000000000005,612.52,712.94,867.29,452.34,530.29]
[854,54,576.36,650.83000000000004,491.08,560.52,728.08,838.93,619.48,724.71,853,53,675.28,786.82,439.72,497.23,576.67999999999995,681.96,375.25,428.86,855.79,1021.15,555.65,640.88,731.02,888.64,473.31,554.26]
[855,55,604.82000000000005,682.13,514.51,586.67999999999995,763.93,879.38,649.16999999999996,758.79,854,54,693.41,807.21,461.01,520.61,591.5,698.71,392.8,448.38,878.47,1047.6400000000001,582.4,671.05,749.64,910.84,495.52,579.66999999999996]
[856,56,635.58000000000004,715.56,539.87,614.61,802.5,922.34,681.22,795.06,855,55,712.35,828.5,483.8,545.65,606.9,716.2,411.58,469.3,902.28,1075.1400000000001,611.13,703.42,769.17,933.79,519.32000000000005,606.96]
[857,57,668.59,751.84,566.99,644.84,843.8,968.62,715.35,834.01,856,56,732.47,850.92,508.41,572.4,623.28,734.61,431.85,491.61,927.16,1103.71,641.95000000000005,737.82,789.66,957.54,544.9,636.01]
[858,58,704.17,790.57,596.30999999999995,676.94,888.42,1018.16,752.26,875.74,857,57,753.6,874.4,534.84,601.39,640.45000000000005,753.87,453.57,515.79,953.26,1133.29,675.01,774.84,811.06,982.1,572.24,667.15]
[859,59,742.69,832.35,627.92999999999995,711.6,936.14,1071.5,791.69,920.36,858,58,775.91,899.12,563.29999999999995,632.41999999999996,658.53,774.15,477.01,541.53,980.44,1164.05,710.64,814.48,833.26,1007.62,601.71,700.53]
[860,60,784.26,877.45,661.96,749.05,988.04,1129.1199999999999,834.55,968.67,859,59,799.56,925.5,594.12,665.81,677.79,795.76,502.31,569.24,1009.01,1196.31,748.89,857.18,856.64,1034.42,633.33000000000004,736.27]
[861,61,829.25,926.09,698.76,789.23,1044.53,1191.45,881.2,1020.99,860,60,825.02,953.85,627.39,701.92,698.39,819.03,529.54,599.20000000000005,1039.6099999999999,1231.04,790.41,903.24,881.68,1063.26,667.63,774.89]
[862,62,877.94,978.73,738.57,832.73,1106.01,1259.5,931.92,1077.97,861,61,852.58,984.35,663.35,740.81,720.75,844.02,558.97,631.35,1072.8900000000001,1268.81,835.56,953.16,908.91,1094.6099999999999,704.92,816.78]
[863,63,930.74,1035.97,781.58,879.97,1173.3599999999999,1333.76,987.34,1140.0899999999999,862,62,882.43,1017.46,702.29,782.97,744.99,871.09,590.79999999999995,666.18,1109.27,1310.22,884.73,1007.57,938.71,1129.01,745.47,862.37]
[864,64,988.31,1097.93,828.45,930.85,1247.3,1415.5,1048.28,1208.4000000000001,863,63,914.9,1053.58,744.56,828.72,771.2,900.62,625.25,703.9,1149.3900000000001,1355.96,938.66,1067,971.61,1167.05,789.87,912.07]
[865,65,1050.95,1165.44,879.27,986.27,1329.37,1505.81,1115.74,1283.79,864,64,950.43,1093.01,790.62,878.26,799.99,932.83,662.7,744.61,1194.28,1406.89,997.83,1132.3800000000001,1008.37,1209.3699999999999,838.61,966.69]
{"$rows_left_out":1051}